BDBM50220035 (5R)-3-(3-fluoro-4-{6-[4-(4-methylpiperazin-1-yl)butanoyl]-pyridin-3-yl}phenyl)-5-(1H-1,2,3-triazol-1-ylmethyl)-1,3-oxazolidin-2-one::CHEMBL231384
SMILES CN1CCN(CCCC(=O)c2ccc(cn2)-c2ccc(cc2F)N2C[C@H](Cn3ccnn3)OC2=O)CC1
InChI Key InChIKey=LRYOKJHAVXZNBC-NRFANRHFSA-N
Data  1 KI
  Tab Delimited (TSV)   2D SDfile   Computed 3D by Vconf -m prep SDfile
Find this compound or compounds like it in BindingDB:
Activity Spreadsheet -- Enzyme Inhibition Constant Data from BindingDB
Found 1 hit for monomerid = 50220035
TargetAmine oxidase [flavin-containing] A(Homo sapiens (Human))
Astrazeneca Discovery
Curated by ChEMBL
LigandPNGBDBM50220035((5R)-3-(3-fluoro-4-{6-[4-(4-methylpiperazin-1-yl)b...)
Affinity DataKi:  1.05E+4nM. Assay description: Inhibition of human liver MAOA expressed in yeast
In DepthDetails ArticlePubMed