BDBM50220037 (5R)-3-(4-{6-[azetidin-3-yl(hydroxy)methyl]pyridin-3-yl}-3-fluorophenyl)-5-(1H-1,2,3-triazol-1-ylmethyl)-1,3-oxazolidin-2-one::CHEMBL440966
SMILES OC(C1CNC1)c1ccc(cn1)-c1ccc(cc1F)N1C[C@H](Cn2ccnn2)OC1=O
InChI Key InChIKey=FJIZGFOMLBITII-DJZRFWRSSA-N
Data  1 KI
  Tab Delimited (TSV)   2D SDfile   Computed 3D by Vconf -m prep SDfile
Find this compound or compounds like it in BindingDB:
Activity Spreadsheet -- Enzyme Inhibition Constant Data from BindingDB
Found 1 hit for monomerid = 50220037
TargetAmine oxidase [flavin-containing] A(Homo sapiens (Human))
Astrazeneca Discovery
Curated by ChEMBL
LigandPNGBDBM50220037((5R)-3-(4-{6-[azetidin-3-yl(hydroxy)methyl]pyridin...)
Affinity DataKi:  5.80E+4nM. Assay description: Inhibition of human liver MAOA expressed in yeast
In DepthDetails ArticlePubMed