BDBM50220191 4-(trifluoromethyl)biphenyl::CHEMBL242993
SMILES FC(F)(F)c1ccc(cc1)-c1ccccc1
InChI Key InChIKey=OUMKBAHMPRLISR-UHFFFAOYSA-N
Data  1 IC50
  Tab Delimited (TSV)   2D SDfile   Computed 3D by Vconf -m prep SDfile
Find this compound or compounds like it in BindingDB:
Activity Spreadsheet -- Enzyme Inhibition Constant Data from BindingDB
Found 1 hit for monomerid = 50220191
TargetKinesin-like protein KIF11(Homo sapiens (Human))
Glaxosmithkline
Curated by ChEMBL
LigandPNGBDBM50220191(4-(trifluoromethyl)biphenyl | CHEMBL242993)
Affinity DataIC50:  5.32E+3nM. Assay description: Inhibition of human KSP motor domain by ATPase assay
In DepthDetails ArticlePubMed