BDBM50220288 1-((2R,6R)-1-(4-chlorophenylsulfonyl)-6-propylpiperidin-2-yl)cyclopropyl 4-(piperidin-1-yl)piperidine-1-carboxylate::CHEMBL239858
SMILES CCC[C@@H]1CCC[C@@H](N1S(=O)(=O)c1ccc(Cl)cc1)C1(CC1)OC(=O)N1CCC(CC1)N1CCCCC1
InChI Key InChIKey=MTNGJFIORXWRNU-AOYPEHQESA-N
Data  1 IC50
  Tab Delimited (TSV)   2D SDfile   Computed 3D by Vconf -m prep SDfile
Find this compound or compounds like it in BindingDB:
Activity Spreadsheet -- Enzyme Inhibition Constant Data from BindingDB
Found 1 hit for monomerid = 50220288
TargetAmyloid-beta precursor protein(Homo sapiens (Human))
Schering-Plough Research Institute
Curated by ChEMBL
LigandPNGBDBM50220288(1-((2R,6R)-1-(4-chlorophenylsulfonyl)-6-propylpipe...)
Affinity DataIC50:  2.5nM. Assay description: Inhibition of gamma-secretase assessed as reduction of membrane Abeta40 level
In DepthDetails ArticlePubMed