BDBM50220717 CHEMBL237964::N-((1s,4s)-4-(6-aminopyridin-3-yl)-4-hydroxycyclohexyl)-3-phenylpropanamide
SMILES Nc1ccc(cn1)[C@@]1(O)CC[C@@H](CC1)NC(=O)CCc1ccccc1
InChI Key InChIKey=UNECXGYKMAXNFJ-MSEWRSJXSA-N
Data  1 IC50
  Tab Delimited (TSV)   2D SDfile   Computed 3D by Vconf -m prep SDfile
Find this compound or compounds like it in BindingDB:
Activity Spreadsheet -- Enzyme Inhibition Constant Data from BindingDB
Found 1 hit for monomerid = 50220717
TargetGlutamate receptor ionotropic, NMDA 2B(Rattus norvegicus (Rat))
Pfizer
Curated by ChEMBL
LigandPNGBDBM50220717(CHEMBL237964 | N-((1s,4s)-4-(6-aminopyridin-3-yl)-...)
Affinity DataIC50: >5.00E+3nM. Assay description: Displacement of [3H]CP101,606 from NR2B in rat forebrain P2 membrane
In DepthDetails ArticlePubMed