BDBM50220720 CHEMBL237752::N-((1s,4s)-4-hydroxy-4-(2-oxo-2,3-dihydrooxazolo[4,5-b]pyridin-6-yl)cyclohexyl)-3-phenylpropanamide
SMILES O[C@@]1(CC[C@@H](CC1)NC(=O)CCc1ccccc1)c1c[nH]c2nc(=O)oc2c1
InChI Key InChIKey=SKJPTQRULJBLIZ-NBEIKUQISA-N
Data  1 IC50
  Tab Delimited (TSV)   2D SDfile   Computed 3D by Vconf -m prep SDfile
Find this compound or compounds like it in BindingDB:
Activity Spreadsheet -- Enzyme Inhibition Constant Data from BindingDB
Found 1 hit for monomerid = 50220720
TargetGlutamate receptor ionotropic, NMDA 2B(Rattus norvegicus (Rat))
Pfizer
Curated by ChEMBL
LigandPNGBDBM50220720(CHEMBL237752 | N-((1s,4s)-4-hydroxy-4-(2-oxo-2,3-d...)
Affinity DataIC50:  85nM. Assay description: Displacement of [3H]CP101,606 from NR2B in rat forebrain P2 membrane
In DepthDetails ArticlePubMed