BDBM50220732 CHEMBL237965::N-((1s,4s)-4-hydroxy-4-(1H-pyrazol-4-yl)cyclohexyl)-3-phenylpropanamide
SMILES O[C@@]1(CC[C@@H](CC1)NC(=O)CCc1ccccc1)c1cn[nH]c1
InChI Key InChIKey=BIJCCJXRZKYLEX-MAEOIBBWSA-N
Data  1 IC50
  Tab Delimited (TSV)   2D SDfile   Computed 3D by Vconf -m prep SDfile
Find this compound or compounds like it in BindingDB:
Activity Spreadsheet -- Enzyme Inhibition Constant Data from BindingDB
Found 1 hit for monomerid = 50220732
TargetGlutamate receptor ionotropic, NMDA 2B(Rattus norvegicus (Rat))
Pfizer
Curated by ChEMBL
LigandPNGBDBM50220732(CHEMBL237965 | N-((1s,4s)-4-hydroxy-4-(1H-pyrazol-...)
Affinity DataIC50:  2.44E+3nM. Assay description: Displacement of [3H]CP101,606 from NR2B in rat forebrain P2 membrane
In DepthDetails ArticlePubMed