BDBM50222103 CHEMBL329792
SMILES Fc1ccc(Sc2nc3CNC(=O)N(c3cc2OC2CCNCC2)c2c(Cl)cccc2Cl)c(F)c1
InChI Key InChIKey=XPWLTGRNORHARK-UHFFFAOYSA-N
Data  3 IC50
  Tab Delimited (TSV)   2D SDfile   Computed 3D by Vconf -m prep SDfile
Find this compound or compounds like it in BindingDB:
Activity Spreadsheet -- Enzyme Inhibition Constant Data from BindingDB
Found 3 hits for monomerid = 50222103
TargetMitogen-activated protein kinase 13(Mus musculus)
Merck Research Laboratories
Curated by ChEMBL
LigandPNGBDBM50222103(CHEMBL329792)
Affinity DataIC50:  11nM. Assay description: Inhibitory activity against mouse Mitogen-activated protein kinase p38
In DepthDetails ArticlePubMed
TargetMitogen-activated protein kinase 11/12/13/14(Homo sapiens (Human))
Merck Research Laboratories
Curated by ChEMBL
LigandPNGBDBM50222103(CHEMBL329792)
Affinity DataIC50:  63nM. Assay description: Inhibition of LPS-induced release of TNF-alpha from human whole blood
In DepthDetails ArticlePubMed
TargetMitogen-activated protein kinase 11/12/13/14(Homo sapiens (Human))
Merck Research Laboratories
Curated by ChEMBL
LigandPNGBDBM50222103(CHEMBL329792)
Affinity DataIC50:  11nM. Assay description: Anti human TNF-alpha activity determined through TNF-alpha release was measured in the supernatants by ELISA
In DepthDetails ArticlePubMed