BDBM50222461 CHEMBL368974
SMILES Cl.CCOC(=O)C1(CCN(CC(F)(F)F)CC1)c1ccccc1
InChI Key InChIKey=KQMPZWYAZKUKQA-UHFFFAOYSA-N
Data  2 IC50
  Tab Delimited (TSV)   2D SDfile   Computed 3D by Vconf -m prep SDfile
Find this compound or compounds like it in BindingDB:
Activity Spreadsheet -- Enzyme Inhibition Constant Data from BindingDB
Found 2 hits for monomerid = 50222461
TargetDelta-type/Kappa-type/Mu-type opioid receptor(Homo sapiens (Human))
TBA
Curated by ChEMBL
LigandPNGBDBM50222461(CHEMBL368974)
Affinity DataIC50:  1.00E+4nM. Assay description: Inhibition of Opioid receptors with [3H]naloxone binding in the absence of NaCl
In DepthDetails ArticlePubMed
TargetDelta-type/Kappa-type/Mu-type opioid receptor(Homo sapiens (Human))
TBA
Curated by ChEMBL
LigandPNGBDBM50222461(CHEMBL368974)
Affinity DataIC50:  6.00E+4nM. Assay description: Inhibition of Opioid receptors binding by inhibiting specific [3H]naloxone binding by 50% in the presence of 100 mM NaCl
In DepthDetails ArticlePubMed