BDBM50223418 CHEMBL313899
SMILES [O-]C(=O)C(F)(F)F.[O-]C(=O)C(F)(F)F.C1CCCCCCc2ccc[n+](CCCCCC\C=C\CCCCCCc3ccc[n+](CCCCCC1)c3)c2
InChI Key InChIKey=MKFIHQDRRUNJRF-OWOJBTEDSA-N
Data  1 IC50
  Tab Delimited (TSV)   2D SDfile   Computed 3D by Vconf -m prep SDfile
Find this compound or compounds like it in BindingDB:
Activity Spreadsheet -- Enzyme Inhibition Constant Data from BindingDB
Found 1 hit for monomerid = 50223418
TargetHistone deacetylase(Homo sapiens (Human))
The University Of Tokyo
Curated by ChEMBL
LigandPNGBDBM50223418(CHEMBL313899)
Affinity DataIC50:  3.00E+4nM. Assay description: Inhibitory activity against histone deacetylase (HDAC)
In DepthDetails ArticlePubMed