BDBM50224172 CHEMBL235496::methyl 4-(4-(2-fluorobenzyloxy)phenyl)-2-amino-7-hydroxy-4H-chromene-3-carboxylate
SMILES COC(=O)C1C(c2ccc(OCc3ccccc3F)cc2)c2ccc(O)cc2OC1=N
InChI Key InChIKey=WPVQQAJSKUHFNZ-UHFFFAOYSA-N
Data  2 IC50
  Tab Delimited (TSV)   2D SDfile   Computed 3D by Vconf -m prep SDfile
Find this compound or compounds like it in BindingDB:
Activity Spreadsheet -- Enzyme Inhibition Constant Data from BindingDB
Found 2 hits for monomerid = 50224172
TargetEstrogen receptor beta(Homo sapiens (Human))
Trinity College
Curated by ChEMBL
LigandPNGBDBM50224172(CHEMBL235496 | methyl 4-(4-(2-fluorobenzyloxy)phen...)
Affinity DataIC50:  780nM. Assay description: Displacement of fluoromone from human recombinant ERbeta by fluorescence polarization assay
In DepthDetails ArticlePubMed
TargetEstrogen receptor(Homo sapiens (Human))
Trinity College
Curated by ChEMBL
LigandPNGBDBM50224172(CHEMBL235496 | methyl 4-(4-(2-fluorobenzyloxy)phen...)
Affinity DataIC50:  53nM. Assay description: Displacement of fluoromone from human recombinant ERalpha by fluorescence polarization assay
In DepthDetails ArticlePubMed