BDBM50225503 CHEMBL347523::OPC-13135
SMILES CCC(O)CN(C(=O)CCCCOc1ccc2NC(=O)CCc2c1)c1ccccc1
InChI Key InChIKey=KPGCOKDHPMZLFJ-UHFFFAOYSA-N
Data  2 IC50
  Tab Delimited (TSV)   2D SDfile   Computed 3D by Vconf -m prep SDfile
Find this compound or compounds like it in BindingDB:
Activity Spreadsheet -- Enzyme Inhibition Constant Data from BindingDB
Found 2 hits for monomerid = 50225503
LigandPNGBDBM50225503(CHEMBL347523 | OPC-13135)
Affinity DataIC50: >1.00E+6nM. Assay description: Inhibition of [Ca(2+)]/calmodulin dependent phosphodiesterase PDE 1 of human brain
In DepthDetails ArticlePubMed
TargetcGMP-inhibited 3',5'-cyclic phosphodiesterase 3A/3B(Homo sapiens (Human))
TBA
Curated by ChEMBL
LigandPNGBDBM50225503(CHEMBL347523 | OPC-13135)
Affinity DataIC50:  73nM. Assay description: Inhibition of low Km cAMP phosphodiesterase PDE III of human platelets
In DepthDetails ArticlePubMed