BDBM50225505 CHEMBL358641::ICI-58301
SMILES CCCc1nc(C)cn2c(NC(C)=O)nnc12
InChI Key InChIKey=QXRRTQNLNYMWKD-UHFFFAOYSA-N
Data  2 KI
  Tab Delimited (TSV)   2D SDfile   Computed 3D by Vconf -m prep SDfile
Find this compound or compounds like it in BindingDB:
Activity Spreadsheet -- Enzyme Inhibition Constant Data from BindingDB
Found 2 hits for monomerid = 50225505
TargetcGMP-inhibited 3',5'-cyclic phosphodiesterase 3A/3B(Homo sapiens (Human))
TBA
Curated by ChEMBL
LigandPNGBDBM50225505(CHEMBL358641 | ICI-58301)
Affinity DataKi:  2.17E+5nM. Assay description: Binding affinity for low Km cAMP phosphodiesterase PDE II of sheep lung
In DepthDetails ArticlePubMed
LigandPNGBDBM50225505(CHEMBL358641 | ICI-58301)
Affinity DataKi:  7.17E+5nM. Assay description: Binding affinity for [Ca(2+)]/calmodulin dependent phosphodiesterase PDE 1 of sheep lung
In DepthDetails ArticlePubMed