BDBM50225985 CHEMBL3349105
SMILES [H][C@@]12CC[C@H](C(=O)NCCCCCCCC)[C@@]1(C)CC[C@@]1([H])[C@@]2([H])CCC2N(C)C(=O)CC[C@]12C
InChI Key InChIKey=BFTLGLGNLAVSON-WPWDJKIZSA-N
Data  2 IC50
  Tab Delimited (TSV)   2D SDfile   Computed 3D by Vconf -m prep SDfile
Find this compound or compounds like it in BindingDB:
Activity Spreadsheet -- Enzyme Inhibition Constant Data from BindingDB
Found 2 hits for monomerid = 50225985
TargetAndrogen receptor(Rattus norvegicus (Rat))
TBA
Curated by ChEMBL
LigandPNGBDBM50225985(CHEMBL3349105)
Affinity DataIC50:  130nM. Assay description: In vitro antagonist activity against rat prostatic androgen receptor (AR)
In DepthDetails ArticlePubMed
Target3-oxo-5-alpha-steroid 4-dehydrogenase 1/2(Rattus norvegicus)
TBA
Curated by ChEMBL
LigandPNGBDBM50225985(CHEMBL3349105)
Affinity DataIC50:  0.210nM. Assay description: In vitro inhibitory activity against rat prostatic steroid 5-alpha-reductase
In DepthDetails ArticlePubMed