BDBM50227616 CHEMBL297007
SMILES CCO\C(O)=C1\[C@H]([C@H](C(=O)OCC)\C(=C\C(=O)c2ccc(Cl)cc2)N=C1C)c1ccccc1C(F)(F)F
InChI Key InChIKey=MUOATLFUJHRSDH-NLBJRWGNSA-N
Data  1 IC50
  Tab Delimited (TSV)   2D SDfile   Computed 3D by Vconf -m prep SDfile
Find this compound or compounds like it in BindingDB:
Activity Spreadsheet -- Enzyme Inhibition Constant Data from BindingDB
Found 1 hit for monomerid = 50227616
TargetVoltage-dependent L-type calcium channel subunit alpha-1S(Rattus norvegicus)
Warner-Lambert
Curated by ChEMBL
LigandPNGBDBM50227616(CHEMBL297007)
Affinity DataIC50:  163nM. Assay description: Inhibition of [3H]nitrendipine binding to calcium channels in the rat brain.
In DepthDetails ArticlePubMed