BDBM50227979 CHEMBL4084561
SMILES Cl.[#7]\[#6](-[#7])=[#7]\[#6](\[#7])=[#7]\[#6]-1-[#6]-[#6]-[#6]-[#6]1
InChI Key InChIKey=MBRPFLDAQGDPAV-UHFFFAOYSA-N
Data  1 EC50
  Tab Delimited (TSV)   2D SDfile   Computed 3D by Vconf -m prep SDfile
Find this compound or compounds like it in BindingDB:
Activity Spreadsheet -- Enzyme Inhibition Constant Data from BindingDB
Found 1 hit for monomerid = 50227979
TargetTrace amine-associated receptor 5(Mus musculus)
University Of Genoa
Curated by ChEMBL
LigandPNGBDBM50227979(CHEMBL4084561)
Affinity DataEC50: >1.00E+4nM. Assay description: Agonist activity at mouse TAAR5 expressed in HEK293 cells assessed as cAMP accumulation after 20 mins by BRET assay
In DepthDetails ArticlePubMed