BDBM50229267 CHEMBL307063
SMILES CCO\C(O)=C1\C(C(C#N)=C(C)N=C1CSc1ccc(Cl)cc1)c1ccccc1C(F)(F)F
InChI Key InChIKey=QZNLLVOQVKZVFD-GHVJWSGMSA-N
Data  1 IC50
  Tab Delimited (TSV)   2D SDfile   Computed 3D by Vconf -m prep SDfile
Find this compound or compounds like it in BindingDB:
Activity Spreadsheet -- Enzyme Inhibition Constant Data from BindingDB
Found 1 hit for monomerid = 50229267
TargetVoltage-dependent L-type calcium channel subunit alpha-1S(Rattus norvegicus)
Warner-Lambert
Curated by ChEMBL
LigandPNGBDBM50229267(CHEMBL307063)
Affinity DataIC50:  100nM. Assay description: Affinity to bind dihydropyridine receptor (DHP receptor) by inhibiting the radioligand [3H]nitrendipine
In DepthDetails ArticlePubMed