BDBM50229623 CHEMBL81281
SMILES [H][C@@]12CC[N@@](C[C@@H]1c1nnn(C)n1)C2
InChI Key InChIKey=BOEPPGXXIWHPAZ-BQBZGAKWSA-N
Data  2 IC50
  Tab Delimited (TSV)   2D SDfile   Computed 3D by Vconf -m prep SDfile
Find this compound or compounds like it in BindingDB:
Activity Spreadsheet -- Enzyme Inhibition Constant Data from BindingDB
Found 2 hits for monomerid = 50229623
TargetMuscarinic acetylcholine receptor M1/M2/M3/M4/M5(RAT)
Smithkline Beecham Pharmaceuticals
Curated by ChEMBL
LigandPNGBDBM50229623(CHEMBL81281)
Affinity DataIC50:  2.90E+3nM. Assay description: In vitro displacement of [3H]quinuclidinyl benzilate (QNB) from rat cerebral cortex muscarinic receptor.
In DepthDetails ArticlePubMed
TargetMuscarinic acetylcholine receptor M1/M2/M3/M4/M5(RAT)
Smithkline Beecham Pharmaceuticals
Curated by ChEMBL
LigandPNGBDBM50229623(CHEMBL81281)
Affinity DataIC50:  11nM. Assay description: In vitro ability to displace [3H]oxotremorine-M (OXO-M) from rat cerebral cortex muscarinic receptor.
In DepthDetails ArticlePubMed