BDBM50229677 CHEMBL79265
SMILES [H][C@@]12CC[N@@](C[C@H]1c1nnn(C)n1)C2
InChI Key InChIKey=BOEPPGXXIWHPAZ-NKWVEPMBSA-N
Data  2 IC50
  Tab Delimited (TSV)   2D SDfile   Computed 3D by Vconf -m prep SDfile
Find this compound or compounds like it in BindingDB:
Activity Spreadsheet -- Enzyme Inhibition Constant Data from BindingDB
Found 2 hits for monomerid = 50229677
TargetMuscarinic acetylcholine receptor M1/M2/M3/M4/M5(RAT)
Smithkline Beecham Pharmaceuticals
Curated by ChEMBL
LigandPNGBDBM50229677(CHEMBL79265)
Affinity DataIC50:  325nM. Assay description: In vitro ability to displace [3H]oxotremorine-M (OXO-M) from rat cerebral cortex muscarinic receptor.
In DepthDetails ArticlePubMed
TargetMuscarinic acetylcholine receptor M1/M2/M3/M4/M5(RAT)
Smithkline Beecham Pharmaceuticals
Curated by ChEMBL
LigandPNGBDBM50229677(CHEMBL79265)
Affinity DataIC50:  3.06E+4nM. Assay description: In vitro displacement of [3H]quinuclidinyl benzilate (QNB) from rat cerebral cortex muscarinic receptor.
In DepthDetails ArticlePubMed