BDBM50229696 CHEMBL419659
SMILES [H][C@@]12CC[N@@](C[C@@H]1n1nnc(Br)n1)C2
InChI Key InChIKey=MBQZCJVGJIXGKX-WDSKDSINSA-N
Data  2 IC50
  Tab Delimited (TSV)   2D SDfile   Computed 3D by Vconf -m prep SDfile
Find this compound or compounds like it in BindingDB:
Activity Spreadsheet -- Enzyme Inhibition Constant Data from BindingDB
Found 2 hits for monomerid = 50229696
TargetMuscarinic acetylcholine receptor M1/M2/M3/M4/M5(RAT)
Smithkline Beecham Pharmaceuticals
Curated by ChEMBL
LigandPNGBDBM50229696(CHEMBL419659)
Affinity DataIC50:  822nM. Assay description: In vitro ability to displace [3H]quinuclidinyl benzilate (QNB) from rat cerebral cortex muscarinic acetylcholine receptor
In DepthDetails ArticlePubMed
TargetMuscarinic acetylcholine receptor M1/M2/M3/M4/M5(RAT)
Smithkline Beecham Pharmaceuticals
Curated by ChEMBL
LigandPNGBDBM50229696(CHEMBL419659)
Affinity DataIC50:  7.40nM. Assay description: In vitro ability to displace [3H]oxotremorine-M (OXO-M) from rat cerebral cortex muscarinic acetylcholine receptor
In DepthDetails ArticlePubMed