BDBM50230414 CHEMBL4104443
SMILES C\C(N)=N/C(=N\S(=O)(=O)c1ccc(I)cc1)/N1CC(C(=N1)c1ccc(Cl)cc1)c1ccccc1
InChI Key InChIKey=SBTNHBPBMKICGR-UHFFFAOYSA-N
Data  2 KI  1 IC50
  Tab Delimited (TSV)   2D SDfile   Computed 3D by Vconf -m prep SDfile
Find this compound or compounds like it in BindingDB:
Activity Spreadsheet -- Enzyme Inhibition Constant Data from BindingDB
Found 3 hits for monomerid = 50230414
TargetCannabinoid receptor 1(Mus musculus (Mouse))
National Institute On Alcohol Abuse And Alcoholism
Curated by ChEMBL
LigandPNGBDBM50230414(CHEMBL4104443)
Affinity DataKi:  10nM. Assay description: Displacement of [3H]CP55940 from mouse brain CB1R expressed in CHOK1 cell membranes
In DepthDetails ArticlePubMed
TargetCannabinoid receptor 2(MOUSE)
National Institute On Alcohol Abuse And Alcoholism
Curated by ChEMBL
LigandPNGBDBM50230414(CHEMBL4104443)
Affinity DataKi: >1.00E+3nM. Assay description: Displacement of [3H]CP55940 from mouse CB2R expressed in CHOK1 cell membranes
In DepthDetails ArticlePubMed
TargetCannabinoid receptor 1(Mus musculus (Mouse))
National Institute On Alcohol Abuse And Alcoholism
Curated by ChEMBL
LigandPNGBDBM50230414(CHEMBL4104443)
Affinity DataIC50:  65nM. Assay description: Inverse agonist at mouse brain CB1R expressed in CHOK1 cell membranes assessed as inhibition of CP55940-stimulated [35S]GTP-gammaS binding measured a...
In DepthDetails ArticlePubMed