BDBM50230441 CHEMBL171681
SMILES CCCCc1nccn1Cc1ccc(cc1)-c1ccccc1C(O)=O
InChI Key InChIKey=BDXYMQYIBLVIPE-UHFFFAOYSA-N
Data  1 IC50
  Tab Delimited (TSV)   2D SDfile   Computed 3D by Vconf -m prep SDfile
Find this compound or compounds like it in BindingDB:
Activity Spreadsheet -- Enzyme Inhibition Constant Data from BindingDB
Found 1 hit for monomerid = 50230441
TargetType-1/Type-2 angiotensin II receptor(Homo sapiens (Human))
Ici Pharmaceuticals Group
Curated by ChEMBL
LigandPNGBDBM50230441(CHEMBL171681)
Affinity DataIC50:  9.40E+3nM. Assay description: Concentration required for 50% displacement of the specifically bound [3-[125I]-iodotyrosyl]-angiotensin II from angiotensin II receptor in the membr...
In DepthDetails ArticlePubMed