BDBM50233072 (E)-3-(3,4-Dichloro-phenyl)-N-{4-[4-(1H-indol-3-yl)-piperidin-1-ylmethyl]-cyclohexyl}-acrylamide::CHEMBL71297::N-((1r,4r)-4-((4-(1H-indol-3-yl)piperidin-1-yl)methyl)cyclohexyl)-3-(3,4-dichlorophenyl)acrylamide
SMILES Clc1ccc(\C=C\C(=O)N[C@H]2CC[C@H](CN3CCC(CC3)c3c[nH]c4ccccc34)CC2)cc1Cl
InChI Key InChIKey=MCLJZDLFPSSHBN-XLRBXMIISA-N
Data  2 KI
  Tab Delimited (TSV)   2D SDfile   Computed 3D by Vconf -m prep SDfile
Find this compound or compounds like it in BindingDB:
Activity Spreadsheet -- Enzyme Inhibition Constant Data from BindingDB
Found 2 hits for monomerid = 50233072
TargetC-C chemokine receptor type 2(Homo sapiens (Human))
Glaxosmithkline
Curated by ChEMBL
LigandPNGBDBM50233072((E)-3-(3,4-Dichloro-phenyl)-N-{4-[4-(1H-indol-3-yl...)
Affinity DataKi:  631nM. Assay description: Inhibition of [125I]MCP-1 binding to the cloned C-C chemokine receptor type 2B expressed in CHO cells
In DepthDetails ArticlePubMed
TargetC-C chemokine receptor type 2(Homo sapiens (Human))
Glaxosmithkline
Curated by ChEMBL
LigandPNGBDBM50233072((E)-3-(3,4-Dichloro-phenyl)-N-{4-[4-(1H-indol-3-yl...)
Affinity DataKi:  631nM. Assay description: Antagonist activity at human CCR2 receptor
In DepthDetails ArticlePubMed