BDBM50233175 CHEMBL4072530
SMILES Fc1ccc(NCc2cc(c(Cl)cc2Cl)S(=O)(=O)N2CCOCC2)cc1F
InChI Key InChIKey=DOBQHQUTJBLGLE-UHFFFAOYSA-N
Data  1 IC50
  Tab Delimited (TSV)   2D SDfile   Computed 3D by Vconf -m prep SDfile
Find this compound or compounds like it in BindingDB:
Activity Spreadsheet -- Enzyme Inhibition Constant Data from BindingDB
Found 1 hit for monomerid = 50233175
TargetEctonucleotide pyrophosphatase/phosphodiesterase family member 2(Homo sapiens (Human))
University Of Tennessee Health Science Center
Curated by ChEMBL
LigandPNGBDBM50233175(CHEMBL4072530)
Affinity DataIC50: >1.00E+3nM. Assay description: Inhibition of recombinant human C-terminal FLAg-tagged ATX lysophospholipase D activity expressed in baculovirus infected sf9 cells using FRET based ...
In DepthDetails ArticlePubMed