BDBM50233184 CHEMBL4064138::US11124490, Compound 22
SMILES Fc1cccc(NS(=O)(=O)c2cc(c(Cl)cc2Cl)S(=O)(=O)N2CCOCC2)c1
InChI Key InChIKey=SLRJXEIQQVISLI-UHFFFAOYSA-N
Data  2 IC50
  Tab Delimited (TSV)   2D SDfile   Computed 3D by Vconf -m prep SDfile
Find this compound or compounds like it in BindingDB:
Activity Spreadsheet -- Enzyme Inhibition Constant Data from BindingDB
Found 2 hits for monomerid = 50233184
TargetAtaxin-1(Homo sapiens (Human))
University of Tennessee Research Foundation
US Patent
LigandPNGBDBM50233184(CHEMBL4064138 | US11124490, Compound 22)
Affinity DataIC50: >1.00E+3nM. Assay description: Compound 3b was found to be the most potent ATX inhibitor with an IC50 of about 9 nM. The mechanism of action was determined to be competitive; howev...
In DepthDetails US Patent
TargetEctonucleotide pyrophosphatase/phosphodiesterase family member 2(Homo sapiens (Human))
University Of Tennessee Health Science Center
Curated by ChEMBL
LigandPNGBDBM50233184(CHEMBL4064138 | US11124490, Compound 22)
Affinity DataIC50: >1.00E+3nM. Assay description: Inhibition of recombinant human C-terminal FLAg-tagged ATX lysophospholipase D activity expressed in baculovirus infected sf9 cells using FRET based ...
In DepthDetails ArticlePubMed