BDBM50233186 CHEMBL4070002::US11124490, Compound 23
SMILES Fc1cc(NS(=O)(=O)c2cc(c(Cl)cc2Cl)S(=O)(=O)N2CCOCC2)cc(F)c1F
InChI Key InChIKey=KSSIJVDBDIVXQX-UHFFFAOYSA-N
Data  2 IC50
  Tab Delimited (TSV)   2D SDfile   Computed 3D by Vconf -m prep SDfile
Find this compound or compounds like it in BindingDB:
Activity Spreadsheet -- Enzyme Inhibition Constant Data from BindingDB
Found 2 hits for monomerid = 50233186
TargetAtaxin-1(Homo sapiens (Human))
University of Tennessee Research Foundation
US Patent
LigandPNGBDBM50233186(CHEMBL4070002 | US11124490, Compound 23)
Affinity DataIC50: >1.00E+3nM. Assay description: Compound 3b was found to be the most potent ATX inhibitor with an IC50 of about 9 nM. The mechanism of action was determined to be competitive; howev...
In DepthDetails US Patent
TargetEctonucleotide pyrophosphatase/phosphodiesterase family member 2(Homo sapiens (Human))
University Of Tennessee Health Science Center
Curated by ChEMBL
LigandPNGBDBM50233186(CHEMBL4070002 | US11124490, Compound 23)
Affinity DataIC50: >1.00E+3nM. Assay description: Inhibition of recombinant human C-terminal FLAg-tagged ATX lysophospholipase D activity expressed in baculovirus infected sf9 cells using FRET based ...
In DepthDetails ArticlePubMed