BDBM50233401 CHEMBL4092488
SMILES COc1ccc(B(O)O)c(NC(=O)c2ccc(Oc3ccc(cc3)C(F)(F)F)nc2)c1
InChI Key InChIKey=DUHPSCWTWCJXFR-UHFFFAOYSA-N
Data  1 IC50
  Tab Delimited (TSV)   2D SDfile   Computed 3D by Vconf -m prep SDfile
Find this compound or compounds like it in BindingDB:
Activity Spreadsheet -- Enzyme Inhibition Constant Data from BindingDB
Found 1 hit for monomerid = 50233401
TargetHormone-sensitive lipase(Homo sapiens (Human))
Daiichi Sankyo
Curated by ChEMBL
LigandPNGBDBM50233401(CHEMBL4092488)
Affinity DataIC50:  59nM. Assay description: Inhibition of recombinant human HSL expressed in baculovirus infected sf9 cells using PNPB as substrate after 5 mins by spectrophotometric method
In DepthDetails ArticlePubMed