BDBM50233402 CHEMBL4082697
SMILES CC1(C)OB(OC1(C)C)c1ccccc1NC(=O)c1ccc(Oc2ccc(cn2)C(F)(F)F)cc1
InChI Key InChIKey=CAUSMDRUAXICDC-UHFFFAOYSA-N
Data  1 IC50
  Tab Delimited (TSV)   2D SDfile   Computed 3D by Vconf -m prep SDfile
Find this compound or compounds like it in BindingDB:
Activity Spreadsheet -- Enzyme Inhibition Constant Data from BindingDB
Found 1 hit for monomerid = 50233402
TargetHormone-sensitive lipase(Homo sapiens (Human))
Daiichi Sankyo
Curated by ChEMBL
LigandPNGBDBM50233402(CHEMBL4082697)
Affinity DataIC50:  180nM. Assay description: Inhibition of recombinant human HSL expressed in baculovirus infected sf9 cells using PNPB as substrate after 5 mins by spectrophotometric method
In DepthDetails ArticlePubMed