BDBM50233409 CHEMBL4084740
SMILES OB(O)c1cc(F)ccc1NC(=O)c1ccc(Oc2ccc(cc2)C(F)(F)F)nc1
InChI Key InChIKey=DAKUMZSEWNHPOC-UHFFFAOYSA-N
Data  1 IC50
  Tab Delimited (TSV)   2D SDfile   Computed 3D by Vconf -m prep SDfile
Find this compound or compounds like it in BindingDB:
Activity Spreadsheet -- Enzyme Inhibition Constant Data from BindingDB
Found 1 hit for monomerid = 50233409
TargetHormone-sensitive lipase(Homo sapiens (Human))
Daiichi Sankyo
Curated by ChEMBL
LigandPNGBDBM50233409(CHEMBL4084740)
Affinity DataIC50:  13nM. Assay description: Inhibition of recombinant human HSL expressed in baculovirus infected sf9 cells using PNPB as substrate after 5 mins by spectrophotometric method
In DepthDetails ArticlePubMed