BDBM50233999 1-(5-(6-(1H-tetrazol-5-yl)pyridin-2-yl)oxazol-2-yl)-7-phenylheptan-1-one::CHEMBL270284
SMILES O=C(CCCCCCc1ccccc1)c1ncc(o1)-c1cccc(n1)-c1nnn[nH]1
InChI Key InChIKey=DJSDSCYFHLFABO-UHFFFAOYSA-N
Data  1 KI  3 IC50
  Tab Delimited (TSV)   2D SDfile   Computed 3D by Vconf -m prep SDfile
Find this compound or compounds like it in BindingDB:
Activity Spreadsheet -- Enzyme Inhibition Constant Data from BindingDB
Found 4 hits for monomerid = 50233999
TargetFatty-acid amide hydrolase 1(Homo sapiens (Human))
The Scripps Research Institute
Curated by ChEMBL
LigandPNGBDBM50233999(1-(5-(6-(1H-tetrazol-5-yl)pyridin-2-yl)oxazol-2-yl...)
Affinity DataKi:  40nMpH: 9.0Assay Description:Inhibition of FAAH (unknown origin) at pH 9
In DepthDetails ArticlePubMed
TargetNeutral cholesterol ester hydrolase 1(Homo sapiens (Human))
The Scripps Research Institute
Curated by ChEMBL
LigandPNGBDBM50233999(1-(5-(6-(1H-tetrazol-5-yl)pyridin-2-yl)oxazol-2-yl...)
Affinity DataIC50: >1.00E+5nM. Assay description: Inhibition of KIAA1363
In DepthDetails ArticlePubMed
TargetLiver carboxylesterase 1(Homo sapiens (Human))
The Scripps Research Institute
Curated by ChEMBL
LigandPNGBDBM50233999(1-(5-(6-(1H-tetrazol-5-yl)pyridin-2-yl)oxazol-2-yl...)
Affinity DataIC50: >1.00E+5nM. Assay description: Inhibition of TGH
In DepthDetails ArticlePubMed
TargetFatty-acid amide hydrolase 1 [30-579](Rattus norvegicus (rat))
The Scripps Research Institute
Curated by ChEMBL
LigandPNGBDBM50233999(1-(5-(6-(1H-tetrazol-5-yl)pyridin-2-yl)oxazol-2-yl...)
Affinity DataIC50:  500nM. Assay description: Inhibition of rat recombinant FAAH expressed in Escherichia coli
In DepthDetails ArticlePubMed