BDBM50235122 CHEMBL4065251
SMILES [H][C@@]1(CC[C@@H](Cc2ccc(cc2)C(=O)N2CCN(Cc3nnn(CC)n3)CC2)N1)[C@H](O)c1ccccc1
InChI Key InChIKey=YTJGHXTUOUBWHF-BFLUCZKCSA-N
Data  5 IC50  2 EC50
  Tab Delimited (TSV)   2D SDfile   Computed 3D by Vconf -m prep SDfile
Find this compound or compounds like it in BindingDB:
Activity Spreadsheet -- Enzyme Inhibition Constant Data from BindingDB
Found 7 hits for monomerid = 50235122
TargetBeta-1 adrenergic receptor(Homo sapiens (Human))
Merck
Curated by ChEMBL
LigandPNGBDBM50235122(CHEMBL4065251)
Affinity DataIC50: >2.00E+4nM. Assay description: Activity at human beta1 adrenergic receptor
In DepthDetails ArticlePubMed
TargetBeta-2 adrenergic receptor(Homo sapiens (Human))
Merck
Curated by ChEMBL
LigandPNGBDBM50235122(CHEMBL4065251)
Affinity DataIC50: >2.00E+4nM. Assay description: Activity at human beta2 adrenergic receptor
In DepthDetails ArticlePubMed
TargetSodium channel protein type 5 subunit alpha(Homo sapiens (Human))
Merck
Curated by ChEMBL
LigandPNGBDBM50235122(CHEMBL4065251)
Affinity DataIC50: >3.00E+4nM. Assay description: Inhibition of human Nav1.5 by electrophysiology method
In DepthDetails ArticlePubMed
TargetPotassium voltage-gated channel subfamily H member 2(Homo sapiens (Human))
Merck
Curated by ChEMBL
LigandPNGBDBM50235122(CHEMBL4065251)
Affinity DataIC50: >6.00E+4nM. Assay description: Inhibition of human ERG
In DepthDetails ArticlePubMed
TargetSodium-dependent noradrenaline transporter(Homo sapiens (Human))
Merck
Curated by ChEMBL
LigandPNGBDBM50235122(CHEMBL4065251)
Affinity DataEC50:  1.52E+3nM. Assay description: Inhibition of NET (unknown origin) expressed in HEK293 cells assessed as reduction in norepinephrine reuptake
In DepthDetails ArticlePubMed
TargetBeta-3 adrenergic receptor(Homo sapiens (Human))
Merck
Curated by ChEMBL
LigandPNGBDBM50235122(CHEMBL4065251)
Affinity DataEC50:  5.10nM. Assay description: Agonist activity at human beta3 adrenergic receptor
In DepthDetails ArticlePubMed
TargetSodium-dependent serotonin transporter(Homo sapiens (Human))
Merck
Curated by ChEMBL
LigandPNGBDBM50235122(CHEMBL4065251)
Affinity DataIC50: >1.00E+4nM. Assay description: Inhibition of SERT (unknown origin)
In DepthDetails ArticlePubMed