BDBM50235844 (S)-2-(5-(2-(3,5-bis(trifluoromethyl)benzyloxy)-1-(2-amino-2-methylpropanamido)ethyl)-1H-tetrazol-1-yl)ethyl 4-hydroxybutylcarbamate::CHEMBL253966
SMILES CC(C)(N)C(=O)N[C@H](COCc1cc(cc(c1)C(F)(F)F)C(F)(F)F)c1nnnn1CCOC(=O)NCCCCO
InChI Key InChIKey=UMEAXKQXNVLSNE-QGZVFWFLSA-N
Data  1 EC50
  Tab Delimited (TSV)   2D SDfile   Computed 3D by Vconf -m prep SDfile
Find this compound or compounds like it in BindingDB:
Activity Spreadsheet -- Enzyme Inhibition Constant Data from BindingDB
Found 1 hit for monomerid = 50235844
TargetGrowth hormone secretagogue receptor type 1(Homo sapiens (Human))
Bristol Myers Squibb
Curated by ChEMBL
LigandPNGBDBM50235844((S)-2-(5-(2-(3,5-bis(trifluoromethyl)benzyloxy)-1-...)
Affinity DataEC50:  34nM. Assay description: Inhibition of human growth hormone secretagogue receptor assessed as measuring intracellular calcium level by FLIPR assay
In DepthDetails ArticlePubMed