BDBM50235936 CHEMBL4099276
SMILES C[C@H](CN1CCOCC1)n1c2ccc(\C=C3/c4ccccc4COc4cc(F)ccc34)cc2[nH]c1=NC#N
InChI Key InChIKey=WGQWOKFBEZMDRZ-RAQUAXEKSA-N
Data  1 KI  1 IC50
  Tab Delimited (TSV)   2D SDfile   Computed 3D by Vconf -m prep SDfile
Find this compound or compounds like it in BindingDB:
Activity Spreadsheet -- Enzyme Inhibition Constant Data from BindingDB
Found 2 hits for monomerid = 50235936
TargetMineralocorticoid receptor(Homo sapiens (Human))
Instituto De Qu£Mica M£Dica (Iqm-Csic)
Curated by ChEMBL
LigandPNGBDBM50235936(CHEMBL4099276)
Affinity DataKi:  0.400nM. Assay description: Displacement of [3H]-Aldosterone from MR overexpressed in human 293 cells measured after 2 hrs by Microbeta scintillation counting method
In DepthDetails ArticlePubMed
TargetMineralocorticoid receptor(Homo sapiens (Human))
Instituto De Qu£Mica M£Dica (Iqm-Csic)
Curated by ChEMBL
LigandPNGBDBM50235936(CHEMBL4099276)
Affinity DataIC50:  21nM. Assay description: Antagonist activity at human MR overexpressed in HEK293 cells assessed as inhibition of aldosterone-induced response measured after overnight incubat...
In DepthDetails ArticlePubMed