BDBM50237540 CHEMBL4065298
SMILES COc1cc(\C=C\C(=O)N2CCC(Cc3ccccc3)CC2)ccc1OCCCCCN1CCN(Cc2ccccc2)CC1
InChI Key InChIKey=OKAVPNAIZIRLRQ-FBMGVBCBSA-N
Data  3 IC50
  Tab Delimited (TSV)   2D SDfile   Computed 3D by Vconf -m prep SDfile
Find this compound or compounds like it in BindingDB:
Activity Spreadsheet -- Enzyme Inhibition Constant Data from BindingDB
Found 3 hits for monomerid = 50237540
TargetAcetylcholinesterase(Electrophorus electricus (Electric eel))
Nanyang Normal University
Curated by ChEMBL
LigandPNGBDBM50237540(CHEMBL4065298)
Affinity DataIC50:  2.62E+3nM. Assay description: Inhibition of electric eel AChE using acetylthiocholine chloride as substrate measured after 15 mins by Ellman's method
In DepthDetails ArticlePubMed
TargetCholinesterase(Equus caballus (Horse))
Nanyang Normal University
Curated by ChEMBL
LigandPNGBDBM50237540(CHEMBL4065298)
Affinity DataIC50:  2.23E+3nM. Assay description: Inhibition of equine serum BuChE using butyrylthiocholine chloride as substrate measured after 15 mins by Ellman's method
In DepthDetails ArticlePubMed
TargetAcetylcholinesterase(Rattus norvegicus (rat))
Nanyang Normal University
Curated by ChEMBL
LigandPNGBDBM50237540(CHEMBL4065298)
Affinity DataIC50:  7.98E+4nM. Assay description: Inhibition of AChE in rat cortex homogenates using acetylthiocholine chloride as substrate measured after 15 mins by Ellman's method
In DepthDetails ArticlePubMed