BDBM50238585 CHEMBL4071400
SMILES CC[C@H](C)[C@@H]1NC(=O)[C@@H]2CCCN2C(=O)[C@H](CO)NC(=O)[C@H](CCCSC)NC(=O)[C@H](C)NC(=O)[C@H](CO)NC(=O)[C@@H]2CSSC[C@H](NC(=O)CN)C(=O)N[C@@H](CSSC[C@H](NC1=O)C(N)=O)C(=O)N[C@@H](C)C(=O)N[C@@H](Cc1cnc[nH]1)C(=O)N1CCC[C@H]1C(=O)N[C@@H](C(C)C)C(=O)N2
InChI Key InChIKey=OLIYOGQBXIVJLB-SNWZINOJSA-N
Data  2 IC50
  Tab Delimited (TSV)   2D SDfile   Computed 3D by Vconf -m prep SDfile
Find this compound or compounds like it in BindingDB:
Activity Spreadsheet -- Enzyme Inhibition Constant Data from BindingDB
Found 2 hits for monomerid = 50238585
TargetNeuronal acetylcholine receptor subunit alpha-3/alpha-6/beta-4(Rattus norvegicus (Rat))
Hainan University
Curated by ChEMBL
LigandPNGBDBM50238585(CHEMBL4071400)
Affinity DataIC50:  64nM. Assay description: Antagonist activity at rat alpha6/alpha3beta4 nACHR expressed in xenopous laevis oocyte assessed as inhibition of ACh induced channel current after 5...
In DepthDetails ArticlePubMed
TargetNeuronal acetylcholine receptor subunit alpha-3/beta-4(Rattus norvegicus (Rat))
Hainan University
Curated by ChEMBL
LigandPNGBDBM50238585(CHEMBL4071400)
Affinity DataIC50:  11nM. Assay description: Antagonist activity at rat alpha3beta4 nACHR expressed in xenopous laevis oocyte assessed as inhibition of ACh induced channel current after 5 mins a...
In DepthDetails ArticlePubMed