BDBM50240498 (S)-1-(2-(pyrrolidine-1-carbonyl)pyrrolidin-1-yl)octan-1-one::1-[(S)-2-(Pyrrolidine-1-carbonyl)-pyrrolidin-1-yl]-octan-1-one::CHEMBL298028
SMILES CCCCCCCC(=O)N1CCC[C@H]1C(=O)N1CCCC1
InChI Key InChIKey=FNZKDUXXKIFDBI-HNNXBMFYSA-N
Data  3 IC50
  Tab Delimited (TSV)   2D SDfile   Computed 3D by Vconf -m prep SDfile
Find this compound or compounds like it in BindingDB:
Activity Spreadsheet -- Enzyme Inhibition Constant Data from BindingDB
Found 3 hits for monomerid = 50240498
TargetProlyl endopeptidase(Rattus norvegicus)
Chinoin
Curated by ChEMBL
LigandPNGBDBM50240498((S)-1-(2-(pyrrolidine-1-carbonyl)pyrrolidin-1-yl)o...)
Affinity DataIC50:  48nM. Assay description: Inhibition of POP in Sprague-Dawley rat brain homogenates
In DepthDetails ArticlePubMed
TargetProlyl endopeptidase(Rattus norvegicus)
Chinoin
Curated by ChEMBL
LigandPNGBDBM50240498((S)-1-(2-(pyrrolidine-1-carbonyl)pyrrolidin-1-yl)o...)
Affinity DataIC50:  20nM. Assay description: Inhibition of POP in rat brain homogenate
In DepthDetails ArticlePubMed
TargetProlyl endopeptidase(Rattus norvegicus)
Chinoin
Curated by ChEMBL
LigandPNGBDBM50240498((S)-1-(2-(pyrrolidine-1-carbonyl)pyrrolidin-1-yl)o...)
Affinity DataIC50:  20nM. Assay description: Inhibitory activity against rat brain Prolyl endopeptidase (PEP)
In DepthDetails Article