BDBM50240702 CHEMBL4063980
SMILES Cc1nc(co1)-c1ccc(Cc2cc3C(=O)N(Cc3cc2C)[C@H]2CCOC[C@@H]2O)cc1
InChI Key InChIKey=VIPKTTPKTQSHOA-ZEQRLZLVSA-N
Data  1 EC50
  Tab Delimited (TSV)   2D SDfile   Computed 3D by Vconf -m prep SDfile
Find this compound or compounds like it in BindingDB:
Activity Spreadsheet -- Enzyme Inhibition Constant Data from BindingDB
Found 1 hit for monomerid = 50240702
TargetMuscarinic acetylcholine receptor M1(Homo sapiens (Human))
Pfizer
Curated by ChEMBL
LigandPNGBDBM50240702(CHEMBL4063980)
Affinity DataEC50:  50nM. Assay description: Positive allosteric modulation of human muscarinic acetylcholine receptor M1 expressed in CHO cells assessed as increase in acetylcholine-induced cal...
In DepthDetails ArticlePubMed