BDBM50241750 CHEMBL4088769
SMILES Cn1cc(ccc1=O)-c1ccccc1Oc1ccccc1
InChI Key InChIKey=UNMTZYAWFXORKZ-UHFFFAOYSA-N
Data  1 KI  1 EC50
  Tab Delimited (TSV)   2D SDfile   Computed 3D by Vconf -m prep SDfile
Find this compound or compounds like it in BindingDB:
Activity Spreadsheet -- Enzyme Inhibition Constant Data from BindingDB
Found 2 hits for monomerid = 50241750
TargetBromodomain-containing protein 4(Homo sapiens (Human))
Abbvie
Curated by ChEMBL
LigandPNGBDBM50241750(CHEMBL4088769)
Affinity DataKi:  890nM. Assay description: Binding affinity to human N-terminal His6-tagged BRD4 BD1-BD2 (K57 to K550 residues) after 1 hr using alexa-647 conjugated probe by TR-FRET assay
In DepthDetails ArticlePubMed
TargetBromodomain-containing protein 4(Homo sapiens (Human))
Abbvie
Curated by ChEMBL
LigandPNGBDBM50241750(CHEMBL4088769)
Affinity DataEC50:  4.10E+3nM. Assay description: Compound was tested in vitro for its inhibitory activity against human placental aldose reductase
In DepthDetails ArticlePubMed