BDBM50241961 CHEMBL4081514
SMILES FC(F)(F)c1ccc(N\N=C(/C#N)C(=O)c2noc3ccccc23)cc1Cl
InChI Key InChIKey=LDYLGZUBSMGFNY-ZMOGYAJESA-N
Data  2 IC50
  Tab Delimited (TSV)   2D SDfile   Computed 3D by Vconf -m prep SDfile
Find this compound or compounds like it in BindingDB:
Activity Spreadsheet -- Enzyme Inhibition Constant Data from BindingDB
Found 2 hits for monomerid = 50241961
TargetRap guanine nucleotide exchange factor 4(Mus musculus)
University Of Texas Medical Branch
Curated by ChEMBL
LigandPNGBDBM50241961(CHEMBL4081514)
Affinity DataIC50:  2.20E+3nM. Assay description: Antagonist activity at mouse EPAC2 assessed as inhibition of EPAC2-mediated Rap1B (1 to 167 residues)-BODIPY GDP nucleotide exchange activity by 8-NB...
In DepthDetails ArticlePubMed
TargetRap guanine nucleotide exchange factor 3(Homo sapiens (Human))
University Of Texas Medical Branch
Curated by ChEMBL
LigandPNGBDBM50241961(CHEMBL4081514)
Affinity DataIC50:  3.00E+3nM. Assay description: Antagonist activity at recombinant human full length EPAC1 assessed as inhibition of EPAC1-mediated Rap1B (1 to 167 residues)-BODIPY GDP nucleotide e...
In DepthDetails ArticlePubMed