BDBM50242002 CHEMBL4060354
SMILES CC(c1cc2cc(cnc2cc1F)-c1cnn(C)c1)n1nnc2ncc(nc12)-c1ccc(C(N)=O)c(F)c1
InChI Key InChIKey=VRLCIBSXFDPHOV-UHFFFAOYSA-N
Data  1 IC50
  Tab Delimited (TSV)   2D SDfile   Computed 3D by Vconf -m prep SDfile
Find this compound or compounds like it in BindingDB:
Activity Spreadsheet -- Enzyme Inhibition Constant Data from BindingDB
Found 1 hit for monomerid = 50242002
TargetHepatocyte growth factor receptor(Homo sapiens (Human))
Shanghai Pharmaceuticals Holding
Curated by ChEMBL
LigandPNGBDBM50242002(CHEMBL4060354)
Affinity DataIC50:  0.600nM. Assay description: Inhibition of c-MET (unknown origin) using TK substrate-biotin peptide as substrate preincubated for 5 to 10 mins followed by ATP addition measured a...
In DepthDetails ArticlePubMed