BDBM50242005 CHEMBL4104884
SMILES CC(c1c(F)cc2ncc(cc2c1F)-c1cnn(C)c1)n1nnc2ncc(nc12)-c1ccc(C(N)=O)c(F)c1
InChI Key InChIKey=NJYNFOKJIPSYGZ-UHFFFAOYSA-N
Data  1 IC50
  Tab Delimited (TSV)   2D SDfile   Computed 3D by Vconf -m prep SDfile
Find this compound or compounds like it in BindingDB:
Activity Spreadsheet -- Enzyme Inhibition Constant Data from BindingDB
Found 1 hit for monomerid = 50242005
TargetHepatocyte growth factor receptor(Homo sapiens (Human))
Shanghai Pharmaceuticals Holding
Curated by ChEMBL
LigandPNGBDBM50242005(CHEMBL4104884)
Affinity DataIC50:  0.300nM. Assay description: Inhibition of c-MET (unknown origin) using TK substrate-biotin peptide as substrate preincubated for 5 to 10 mins followed by ATP addition measured a...
In DepthDetails ArticlePubMed