BDBM50242011 CHEMBL4070258
SMILES CC(c1c(F)cc2ncc(cc2c1F)-c1cnn(C)c1)n1nnc2ncc(nc12)-c1cnn(CCO)c1
InChI Key InChIKey=CDKUEZFECJGOFN-UHFFFAOYSA-N
Data  1 IC50
  Tab Delimited (TSV)   2D SDfile   Computed 3D by Vconf -m prep SDfile
Find this compound or compounds like it in BindingDB:
Activity Spreadsheet -- Enzyme Inhibition Constant Data from BindingDB
Found 1 hit for monomerid = 50242011
TargetHepatocyte growth factor receptor(Homo sapiens (Human))
Shanghai Pharmaceuticals Holding
Curated by ChEMBL
LigandPNGBDBM50242011(CHEMBL4070258)
Affinity DataIC50:  0.400nM. Assay description: Compound was evaluated for its binding affinity by displacement of [3H]- DAMPGO from opioid receptor mu by using opioid radioligand binding assay
In DepthDetails ArticlePubMed