BDBM50243388 AT-9283::US10981896, Compound AT9283
SMILES O=C(NC1CC1)Nc1c[nH]nc1-c1nc2cc(CN3CCOCC3)ccc2[nH]1
InChI Key InChIKey=LOLPPWBBNUVNQZ-UHFFFAOYSA-N
Data  16 IC50  1 Kd
PDB links: 6 PDB IDs match this monomer.
  Tab Delimited (TSV)   2D SDfile   Computed 3D by Vconf -m prep SDfile
Find this compound or compounds like it in BindingDB:
Activity Spreadsheet -- Enzyme Inhibition Constant Data from BindingDB
Found 17 hits for monomerid = 50243388
TargetTyrosine-protein kinase JAK2(Homo sapiens (Human))
Yale University
Curated by ChEMBL
LigandPNGBDBM50243388(AT-9283 | US10981896, Compound AT9283)
Affinity DataKd:  11nM. Assay description: Binding affinity to N-terminal TEV-cleavable hexa-histidine tagged human JAK2 JH1 domain (840 to 1132 residues) expressed in baculovirus-infected Sf9...
TargetTyrosine-protein kinase JAK3(Homo sapiens (Human))TBA
LigandPNGBDBM50243388(AT-9283 | US10981896, Compound AT9283)
Affinity DataIC50:  1.10nM. Assay description: Inhibition of JAK3 (unknown origin)
In DepthDetails PubMed
TargetAurora kinase B(Homo sapiens (Human))
Nirma University
Curated by ChEMBL
LigandPNGBDBM50243388(AT-9283 | US10981896, Compound AT9283)
Affinity DataIC50:  30nM. Assay description: Inhibition of Aurora B kinase in human HCT116 cells assessed as reduction in polyploid phenotype
In DepthDetails ArticlePubMed
TargetMaternal embryonic leucine zipper kinase(Homo sapiens (Human))
Board of Regents, The University of Texas System
US Patent
LigandPNGBDBM50243388(AT-9283 | US10981896, Compound AT9283)
Affinity DataIC50:  685nM. Assay description: MELK and its substrate, Bcl-G were both recombinantly expressed and purified for use in screening assays (See Methods). 752 compounds from an in-hous...
In DepthDetails US Patent
TargetAurora kinase B(Homo sapiens (Human))
Nirma University
Curated by ChEMBL
LigandPNGBDBM50243388(AT-9283 | US10981896, Compound AT9283)
Affinity DataIC50:  30nM. Assay description: Inhibition of Aurora B in human B-NHL cells assessed as inhibition of histone H3 phosphorylation on Ser10 by immunoblotting analysis
In DepthDetails ArticlePubMed
TargetDual specificity tyrosine-phosphorylation-regulated kinase 2(Homo sapiens (Human))
Masaryk University
Curated by ChEMBL
LigandPNGBDBM50243388(AT-9283 | US10981896, Compound AT9283)
Affinity DataIC50:  570nM. Assay description: Inhibition of DYRK2 (unknown origin) by NanoBRET cellular target engagement assay
In DepthDetails ArticlePubMed
TargetCyclin-dependent kinase-like 3(Homo sapiens (Human))
Masaryk University
Curated by ChEMBL
LigandPNGBDBM50243388(AT-9283 | US10981896, Compound AT9283)
Affinity DataIC50:  1.10E+3nM. Assay description: Inhibition of CDKL3 (unknown origin) by NanoBRET cellular target engagement assay
In DepthDetails ArticlePubMed
TargetTyrosine-protein kinase JAK2(Homo sapiens (Human))
Yale University
Curated by ChEMBL
LigandPNGBDBM50243388(AT-9283 | US10981896, Compound AT9283)
Affinity DataIC50:  2.20nM. Assay description: Inhibition of JAK2 (unknown origin) incubated for 40 mins in presence of ATP by Kinase-glo luminescence assay
TargetTyrosine-protein kinase JAK3(Homo sapiens (Human))TBA
LigandPNGBDBM50243388(AT-9283 | US10981896, Compound AT9283)
Affinity DataIC50:  1.20nM. Assay description: Inhibition of JAK3 (unknown origin) incubated for 40 mins in presence of ATP by Kinase-glo luminescence assay
In DepthDetails ArticlePubMed
TargetAurora kinase A(Homo sapiens (Human))
Xuzhou Medical University
Curated by ChEMBL
LigandPNGBDBM50243388(AT-9283 | US10981896, Compound AT9283)
Affinity DataIC50:  26nM. Assay description: Inhibition of Aurora A (unknown origin) incubated for 40 mins in presence of ATP by Kinase-glo luminescence assay
TargetAurora kinase B(Homo sapiens (Human))
Nirma University
Curated by ChEMBL
LigandPNGBDBM50243388(AT-9283 | US10981896, Compound AT9283)
Affinity DataIC50:  62nM. Assay description: Inhibition of Aurora B (unknown origin) incubated for 40 mins in presence of ATP by Kinase-glo luminescence assay
In DepthDetails ArticlePubMed
TargetTyrosine-protein kinase ABL1(Homo sapiens (Human))
Hangzhou Medical College
Curated by ChEMBL
LigandPNGBDBM50243388(AT-9283 | US10981896, Compound AT9283)
Affinity DataIC50:  4nM. Assay description: Inhibition of Abl T315I mutant (unknown origin)
In DepthDetails PubMed
TargetTyrosine-protein kinase JAK2(Homo sapiens (Human))
Yale University
Curated by ChEMBL
LigandPNGBDBM50243388(AT-9283 | US10981896, Compound AT9283)
Affinity DataIC50:  1.20nM. Assay description: Inhibition of JAK 2 (unknown origin)
TargetTyrosine-protein kinase JAK3(Homo sapiens (Human))TBA
LigandPNGBDBM50243388(AT-9283 | US10981896, Compound AT9283)
Affinity DataIC50:  1.10nM. Assay description: Inhibition of JAK 3 (unknown origin)
In DepthDetails PubMed
TargetSerine/threonine-protein kinase 25(Homo sapiens (Human))TBA
LigandPNGBDBM50243388(AT-9283 | US10981896, Compound AT9283)
Affinity DataIC50:  460nM. Assay description: Binding affinity towards rat beta adrenergic receptor from lung membranes.
TargetTyrosine-protein kinase JAK2(Homo sapiens (Human))
Yale University
Curated by ChEMBL
LigandPNGBDBM50243388(AT-9283 | US10981896, Compound AT9283)
Affinity DataIC50:  1.20nM. Assay description: Inhibition of JAK2 (unknown origin)
TargetMaternal embryonic leucine zipper kinase(Homo sapiens (Human))
Board of Regents, The University of Texas System
US Patent
LigandPNGBDBM50243388(AT-9283 | US10981896, Compound AT9283)
Affinity DataIC50:  685nM. Assay description: Inhibition of His6-tagged MELK catalytic domain (1 to 340 residues) (unknown origin) expressed in Escherichia coli BL21 (DE3) cells using Bcl-GL as s...
In DepthDetails ArticlePubMed