BDBM50243874 (+)-(S)-4-Amino-1-cyclopent-1-enyl(methyl)phosphinic acid::CHEMBL447171
SMILES CP(O)(=O)C1=CC[C@H](N)C1
InChI Key InChIKey=COSQDVKDGWGBPW-YFKPBYRVSA-N
Data  1 EC50
  Tab Delimited (TSV)   2D SDfile   Computed 3D by Vconf -m prep SDfile
Find this compound or compounds like it in BindingDB:
Activity Spreadsheet -- Enzyme Inhibition Constant Data from BindingDB
Found 1 hit for monomerid = 50243874
TargetGamma-aminobutyric acid type B receptor subunit 1(Homo sapiens (Human))
University Of Sydney
Curated by ChEMBL
LigandPNGBDBM50243874((+)-(S)-4-Amino-1-cyclopent-1-enyl(methyl)phosphin...)
Affinity DataEC50:  5.22E+4nM. Assay description: Agonist activity at human GABAb 1A/2 receptor expressed in Xenopus oocytes assessed as whole cell current production by two electrode voltage clamp m...
In DepthDetails ArticlePubMed