BDBM50244536 1-{5-Nitro-6-[4-(3-oxo-butyl)-phenoxy]-pyrimidin-4-yl}-piperidine-4-carboxylic acid ethyl ester::CHEMBL452824
SMILES CCOC(=O)C1CCN(CC1)c1ncnc(Oc2ccc(CCC(C)=O)cc2)c1[N+]([O-])=O
InChI Key InChIKey=TWNLUCSCGWJPQM-UHFFFAOYSA-N
Data  1 EC50
  Tab Delimited (TSV)   2D SDfile   Computed 3D by Vconf -m prep SDfile
Find this compound or compounds like it in BindingDB:
Activity Spreadsheet -- Enzyme Inhibition Constant Data from BindingDB
Found 1 hit for monomerid = 50244536
TargetGlucose-dependent insulinotropic receptor(Homo sapiens (Human))
Arena Pharmaceuticals
Curated by ChEMBL
LigandPNGBDBM50244536(1-{5-Nitro-6-[4-(3-oxo-butyl)-phenoxy]-pyrimidin-4...)
Affinity DataEC50:  1.70E+3nM. Assay description: Agonist activity at GPR119 (unknown origin) expressed in HEK293 cells assessed as cAMP level by flash plate assay
In DepthDetails ArticlePubMed