BDBM50244537 CHEMBL508439::ethyl 1-(6-(4-(2-methoxyethoxy)phenoxy)-5-nitropyrimidin-4-yl)piperidine-4-carboxylate
SMILES CCOC(=O)C1CCN(CC1)c1ncnc(Oc2ccc(OCCOC)cc2)c1[N+]([O-])=O
InChI Key InChIKey=WJXYIQLAOGCMND-UHFFFAOYSA-N
Data  1 IC50
  Tab Delimited (TSV)   2D SDfile   Computed 3D by Vconf -m prep SDfile
Find this compound or compounds like it in BindingDB:
Activity Spreadsheet -- Enzyme Inhibition Constant Data from BindingDB
Found 1 hit for monomerid = 50244537
TargetGlucose-dependent insulinotropic receptor(Homo sapiens (Human))
Arena Pharmaceuticals
Curated by ChEMBL
LigandPNGBDBM50244537(CHEMBL508439 | ethyl 1-(6-(4-(2-methoxyethoxy)phen...)
Affinity DataIC50:  500nM. Assay description: Inverse agonist activity at GPR119 (unknown origin) expressed in HEK293 cells assessed as cAMP level by flash plate assay
In DepthDetails ArticlePubMed