BDBM50244566 (2R,3S)-2,3-dihydroxy-4-(naphthalen-2-ylsulfonyl)-N-((R)-6-(piperidin-1-ylmethyl)-1,2,3,4-tetrahydronaphthalen-1-yl)butanamide::CHEMBL453339
SMILES O[C@H](CS(=O)(=O)c1ccc2ccccc2c1)[C@@H](O)C(=O)N[C@@H]1CCCc2cc(CN3CCCCC3)ccc12
InChI Key InChIKey=XENUKVRWXVFLTR-MPFGFTFXSA-N
Data  1 KI  2 IC50
  Tab Delimited (TSV)   2D SDfile   Computed 3D by Vconf -m prep SDfile
Find this compound or compounds like it in BindingDB:
Activity Spreadsheet -- Enzyme Inhibition Constant Data from BindingDB
Found 3 hits for monomerid = 50244566
TargetB1 bradykinin receptor(Homo sapiens (Human))
Amgen
Curated by ChEMBL
LigandPNGBDBM50244566((2R,3S)-2,3-dihydroxy-4-(naphthalen-2-ylsulfonyl)-...)
Affinity DataKi:  1.70nM. Assay description: Displacement of [3H]DAK from human bradykinin B1 receptor expressed in clone CHO-D-/aequorin cells
In DepthDetails ArticlePubMed
TargetB1 bradykinin receptor(Homo sapiens (Human))
Amgen
Curated by ChEMBL
LigandPNGBDBM50244566((2R,3S)-2,3-dihydroxy-4-(naphthalen-2-ylsulfonyl)-...)
Affinity DataIC50:  4nM. Assay description: Antagonist activity at human bradykinin B1 receptor expressed in clone CHO-D-/aequorin cells by aquerin based assay
In DepthDetails ArticlePubMed
TargetB1 bradykinin receptor(Oryctolagus cuniculus)
Amgen
Curated by ChEMBL
LigandPNGBDBM50244566((2R,3S)-2,3-dihydroxy-4-(naphthalen-2-ylsulfonyl)-...)
Affinity DataIC50:  20nM. Assay description: Antagonist activity at rabbit bradykinin B1 receptor expressed in clone CHO-D-/aequorin cells by aquerin based assay
In DepthDetails ArticlePubMed