BDBM50244588 1-[5-Nitro-6-(4-[1,2,4]triazol-1-yl-phenoxy)-pyrimidin-4-yl]-piperidine-4-carboxylic acid ethyl ester::CHEMBL451796
SMILES CCOC(=O)C1CCN(CC1)c1ncnc(Oc2ccc(cc2)-n2cncn2)c1[N+]([O-])=O
InChI Key InChIKey=BEQXVWQBFMRYNW-UHFFFAOYSA-N
Data  1 EC50
  Tab Delimited (TSV)   2D SDfile   Computed 3D by Vconf -m prep SDfile
Find this compound or compounds like it in BindingDB:
Activity Spreadsheet -- Enzyme Inhibition Constant Data from BindingDB
Found 1 hit for monomerid = 50244588
TargetGlucose-dependent insulinotropic receptor(Homo sapiens (Human))
Arena Pharmaceuticals
Curated by ChEMBL
LigandPNGBDBM50244588(1-[5-Nitro-6-(4-[1,2,4]triazol-1-yl-phenoxy)-pyrim...)
Affinity DataEC50:  2.50E+3nM. Assay description: Agonist activity at GPR119 (unknown origin) expressed in HEK293 cells assessed as cAMP level by flash plate assay
In DepthDetails ArticlePubMed