BDBM50244589 1-[6-(4-Methanesulfonyl-phenylamino)-5-nitro-pyrimidin-4-yl]-piperidine-4-carboxylic acid ethyl ester::CHEMBL451797
SMILES CCOC(=O)C1CCN(CC1)c1ncnc(Nc2ccc(cc2)S(C)(=O)=O)c1[N+]([O-])=O
InChI Key InChIKey=NMFLPNKHJXTHLM-UHFFFAOYSA-N
Data  1 EC50
  Tab Delimited (TSV)   2D SDfile   Computed 3D by Vconf -m prep SDfile
Find this compound or compounds like it in BindingDB:
Activity Spreadsheet -- Enzyme Inhibition Constant Data from BindingDB
Found 1 hit for monomerid = 50244589
TargetGlucose-dependent insulinotropic receptor(Homo sapiens (Human))
Arena Pharmaceuticals
Curated by ChEMBL
LigandPNGBDBM50244589(1-[6-(4-Methanesulfonyl-phenylamino)-5-nitro-pyrim...)
Affinity DataEC50:  1.20E+3nM. Assay description: Agonist activity at GPR119 (unknown origin) expressed in HEK293 cells assessed as cAMP level by flash plate assay
In DepthDetails ArticlePubMed