BDBM50244671 2-Chloro-5-(3-fluoro-benzoylamino)-N-pyridin-3-yl-benzamide::CHEMBL512385
SMILES Fc1cccc(c1)C(=O)Nc1ccc(Cl)c(c1)C(=O)Nc1cccnc1
InChI Key InChIKey=MKIXXPCHZHGLCB-UHFFFAOYSA-N
Data  1 IC50
  Tab Delimited (TSV)   2D SDfile   Computed 3D by Vconf -m prep SDfile
Find this compound or compounds like it in BindingDB:
Activity Spreadsheet -- Enzyme Inhibition Constant Data from BindingDB
Found 1 hit for monomerid = 50244671
TargetMacrophage colony-stimulating factor 1 receptor(Homo sapiens (Human))
Astrazeneca R&D Boston
Curated by ChEMBL
LigandPNGBDBM50244671(2-Chloro-5-(3-fluoro-benzoylamino)-N-pyridin-3-yl-...)
Affinity DataIC50:  25nM. Assay description: Inhibition of CSF1R (unknown origin)
In DepthDetails ArticlePubMed